{"text_format":"1","workbook":"xlsx","n_sheets":4,"sheets":["Shopping list","Step 1","Preview","day"],"not_rendered":{"charts":0,"images":0,"macros":1,"external_links":0,"defined_names":1,"comments":0,"pivot_tables":0},"unopened":[],"bounds":{"document_bytes":16777216,"sheet_cells":100000,"rows_first":2000,"rows_last":500,"rows_between":2000,"halvings":0,"cell_chars":16384,"cell_head_chars":4096},"cells_cut":0,"cells_raw":0,"read":"whole","date_system":"1900"}

{"sheet":"Shopping list","index":0,"n_rows":31,"n_cols":8,"rows_kept":31,"cut":false,"hidden":true,"merged":[[1,2,1,3],[3,2,3,7]]}
[]
[]
[]
[null,null,"Weekly lunchbox calendar shopping list","Weekly lunchbox calendar","Weekly lunchbox calendar","Weekly lunchbox calendar"]
[]
[null,null,"Day 1","Day 2","Day 3","Day 4","Day 5","Day 6"]
[]
[null,null,{"$f":"#REF!","v":{"$error":"#REF!"}},{"$f":"#REF!","v":{"$error":"#REF!"}},{"$f":"#REF!","v":{"$error":"#REF!"}},{"$f":"#REF!","v":{"$error":"#REF!"}},{"$f":"#REF!","v":{"$error":"#REF!"}},{"$f":"#REF!","v":{"$error":"#REF!"}}]
[null,null,{"$f":"#REF!","v":{"$error":"#REF!"}},{"$f":"#REF!","v":{"$error":"#REF!"}},{"$f":"#REF!","v":{"$error":"#REF!"}},{"$f":"#REF!","v":{"$error":"#REF!"}},{"$f":"#REF!","v":{"$error":"#REF!"}},{"$f":"#REF!","v":{"$error":"#REF!"}}]
[null,null,{"$f":"#REF!","v":{"$error":"#REF!"}},{"$f":"#REF!","v":{"$error":"#REF!"}},{"$f":"#REF!","v":{"$error":"#REF!"}},{"$f":"#REF!","v":{"$error":"#REF!"}},{"$f":"#REF!","v":{"$error":"#REF!"}},{"$f":"#REF!","v":{"$error":"#REF!"}}]
[null,null,{"$f":"#REF!","v":{"$error":"#REF!"}},{"$f":"#REF!","v":{"$error":"#REF!"}},{"$f":"#REF!","v":{"$error":"#REF!"}},{"$f":"#REF!","v":{"$error":"#REF!"}},{"$f":"#REF!","v":{"$error":"#REF!"}},{"$f":"#REF!","v":{"$error":"#REF!"}}]
[null,null,{"$f":"#REF!","v":{"$error":"#REF!"}},{"$f":"#REF!","v":{"$error":"#REF!"}},{"$f":"#REF!","v":{"$error":"#REF!"}},{"$f":"#REF!","v":{"$error":"#REF!"}},{"$f":"#REF!","v":{"$error":"#REF!"}},{"$f":"#REF!","v":{"$error":"#REF!"}}]
[null,null,{"$f":"#REF!","v":{"$error":"#REF!"}},{"$f":"#REF!","v":{"$error":"#REF!"}},{"$f":"#REF!","v":{"$error":"#REF!"}},{"$f":"#REF!","v":{"$error":"#REF!"}},{"$f":"#REF!","v":{"$error":"#REF!"}},{"$f":"#REF!","v":{"$error":"#REF!"}}]
[null,null,{"$f":"#REF!","v":{"$error":"#REF!"}},{"$f":"#REF!","v":{"$error":"#REF!"}},{"$f":"#REF!","v":{"$error":"#REF!"}},{"$f":"#REF!","v":{"$error":"#REF!"}},{"$f":"#REF!","v":{"$error":"#REF!"}},{"$f":"#REF!","v":{"$error":"#REF!"}}]
[null,null,{"$f":"#REF!","v":{"$error":"#REF!"}},{"$f":"#REF!","v":{"$error":"#REF!"}},{"$f":"#REF!","v":{"$error":"#REF!"}},{"$f":"#REF!","v":{"$error":"#REF!"}},{"$f":"#REF!","v":{"$error":"#REF!"}},{"$f":"#REF!","v":{"$error":"#REF!"}}]
[null,null,{"$f":"#REF!","v":{"$error":"#REF!"}},{"$f":"#REF!","v":{"$error":"#REF!"}},{"$f":"#REF!","v":{"$error":"#REF!"}},{"$f":"#REF!","v":{"$error":"#REF!"}},{"$f":"#REF!","v":{"$error":"#REF!"}},{"$f":"#REF!","v":{"$error":"#REF!"}}]
[null,null,{"$f":"#REF!","v":{"$error":"#REF!"}},{"$f":"#REF!","v":{"$error":"#REF!"}},{"$f":"#REF!","v":{"$error":"#REF!"}},{"$f":"#REF!","v":{"$error":"#REF!"}},{"$f":"#REF!","v":{"$error":"#REF!"}},{"$f":"#REF!","v":{"$error":"#REF!"}}]
[null,null,{"$f":"#REF!","v":{"$error":"#REF!"}},{"$f":"#REF!","v":{"$error":"#REF!"}},{"$f":"#REF!","v":{"$error":"#REF!"}},{"$f":"#REF!","v":{"$error":"#REF!"}},{"$f":"#REF!","v":{"$error":"#REF!"}},{"$f":"#REF!","v":{"$error":"#REF!"}}]
[null,null,{"$f":"#REF!","v":{"$error":"#REF!"}},{"$f":"#REF!","v":{"$error":"#REF!"}},{"$f":"#REF!","v":{"$error":"#REF!"}},{"$f":"#REF!","v":{"$error":"#REF!"}},{"$f":"#REF!","v":{"$error":"#REF!"}},{"$f":"#REF!","v":{"$error":"#REF!"}}]
[null,null,{"$f":"#REF!","v":{"$error":"#REF!"}},{"$f":"#REF!","v":{"$error":"#REF!"}},{"$f":"#REF!","v":{"$error":"#REF!"}},{"$f":"#REF!","v":{"$error":"#REF!"}},{"$f":"#REF!","v":{"$error":"#REF!"}},{"$f":"#REF!","v":{"$error":"#REF!"}}]
[null,null,{"$f":"#REF!","v":{"$error":"#REF!"}},{"$f":"#REF!","v":{"$error":"#REF!"}},{"$f":"#REF!","v":{"$error":"#REF!"}},{"$f":"#REF!","v":{"$error":"#REF!"}},{"$f":"#REF!","v":{"$error":"#REF!"}},{"$f":"#REF!","v":{"$error":"#REF!"}}]
[null,null,{"$f":"#REF!","v":{"$error":"#REF!"}},{"$f":"#REF!","v":{"$error":"#REF!"}},{"$f":"#REF!","v":{"$error":"#REF!"}},{"$f":"#REF!","v":{"$error":"#REF!"}},{"$f":"#REF!","v":{"$error":"#REF!"}},{"$f":"#REF!","v":{"$error":"#REF!"}}]
[null,null,{"$f":"#REF!","v":{"$error":"#REF!"}},{"$f":"#REF!","v":{"$error":"#REF!"}},{"$f":"#REF!","v":{"$error":"#REF!"}},{"$f":"#REF!","v":{"$error":"#REF!"}},{"$f":"#REF!","v":{"$error":"#REF!"}},{"$f":"#REF!","v":{"$error":"#REF!"}}]
[null,null,{"$f":"#REF!","v":{"$error":"#REF!"}},{"$f":"#REF!","v":{"$error":"#REF!"}},{"$f":"#REF!","v":{"$error":"#REF!"}},{"$f":"#REF!","v":{"$error":"#REF!"}},{"$f":"#REF!","v":{"$error":"#REF!"}},{"$f":"#REF!","v":{"$error":"#REF!"}}]
[null,null,{"$f":"#REF!","v":{"$error":"#REF!"}},{"$f":"#REF!","v":{"$error":"#REF!"}},{"$f":"#REF!","v":{"$error":"#REF!"}},{"$f":"#REF!","v":{"$error":"#REF!"}},{"$f":"#REF!","v":{"$error":"#REF!"}},{"$f":"#REF!","v":{"$error":"#REF!"}}]
[null,null,{"$f":"#REF!","v":{"$error":"#REF!"}},{"$f":"#REF!","v":{"$error":"#REF!"}},{"$f":"#REF!","v":{"$error":"#REF!"}},{"$f":"#REF!","v":{"$error":"#REF!"}},{"$f":"#REF!","v":{"$error":"#REF!"}},{"$f":"#REF!","v":{"$error":"#REF!"}}]
[null,null,{"$f":"#REF!","v":{"$error":"#REF!"}},{"$f":"#REF!","v":{"$error":"#REF!"}},{"$f":"#REF!","v":{"$error":"#REF!"}},{"$f":"#REF!","v":{"$error":"#REF!"}},{"$f":"#REF!","v":{"$error":"#REF!"}},{"$f":"#REF!","v":{"$error":"#REF!"}}]
[null,null,{"$f":"#REF!","v":{"$error":"#REF!"}},{"$f":"#REF!","v":{"$error":"#REF!"}},{"$f":"#REF!","v":{"$error":"#REF!"}},{"$f":"#REF!","v":{"$error":"#REF!"}},{"$f":"#REF!","v":{"$error":"#REF!"}},{"$f":"#REF!","v":{"$error":"#REF!"}}]
[null,null,{"$f":"#REF!","v":{"$error":"#REF!"}},{"$f":"#REF!","v":{"$error":"#REF!"}},{"$f":"#REF!","v":{"$error":"#REF!"}},{"$f":"#REF!","v":{"$error":"#REF!"}},{"$f":"#REF!","v":{"$error":"#REF!"}},{"$f":"#REF!","v":{"$error":"#REF!"}}]
[null,null,{"$f":"#REF!","v":{"$error":"#REF!"}},{"$f":"#REF!","v":{"$error":"#REF!"}},{"$f":"#REF!","v":{"$error":"#REF!"}},{"$f":"#REF!","v":{"$error":"#REF!"}},{"$f":"#REF!","v":{"$error":"#REF!"}},{"$f":"#REF!","v":{"$error":"#REF!"}}]
[null,null,{"$f":"#REF!","v":{"$error":"#REF!"}},{"$f":"#REF!","v":{"$error":"#REF!"}},{"$f":"#REF!","v":{"$error":"#REF!"}},{"$f":"#REF!","v":{"$error":"#REF!"}},{"$f":"#REF!","v":{"$error":"#REF!"}},{"$f":"#REF!","v":{"$error":"#REF!"}}]

{"sheet":"Step 1","index":1,"n_rows":161,"n_cols":13,"rows_kept":161,"cut":false,"hidden":false,"merged":[[2,2,2,4],[4,2,4,4]]}
[]
[]
[null,null,"Items",null,null,null,null,1,"Today's lunchbox",null,3,"Check the PREVIEW sheet - then"]
[null,null,null,null,null,null,null,null,null,null,null,"select  day & click create lunchbox"]
[null,null,"Random suggestions",null,null,null,null,"Protein 1","Protein 2","Protein 3"]
[null,null,null,null,null,null,null,"A none","A none","A none"]
[null,null,"Protein",null,"Starch"]
[null,null,{"$f":"INDEX($C$36:$C$55,RANK(D36,$D$36:$D$55))","v":"Rabbit"},null,{"$f":"INDEX($J$36:$J$55,RANK(K36,$K$36:$K$55))","v":"Oats"},null,null,"Prep1","Prep 2","Prep 3"]
[null,null,{"$f":"INDEX($C$36:$C$55,RANK(D37,$D$36:$D$55))","v":"Bacon"},null,"Buns",null,null,"A none","A none","A none"]
[null,null,"Beef",null,"Pita"]
[null,null,"Quail",null,"Baps",null,null,"Starch 1","Starch 2","Starch 3","Starch 4"]
[null,null,"Oxtail",null,"Crackers",null,null,"A none","A none","A none","A none"]
[null,null,"Fish",null,"Croissant"]
[null,null,"Meatloaf",null,"Rice",null,null,"Side 1","Side 2","Side 3","Side 4","Side 5","Side 6"]
[null,null,"Venison",null,"Pap",null,null,"A none","A none","A none","A none","A none","A none"]
[null,null,"Chicken",null,{"$f":"INDEX($J$36:$J$55,RANK(K45,$K$36:$K$55))","v":"Tortilla"},null,null,null,null,null,null,2]
[null,null,"Pork",null,{"$f":"INDEX($J$36:$J$55,RANK(K46,$K$36:$K$55))","v":"Tacos"},null,null,"Enter the ingredients you need (create your shopping list)",null,null,null,"(to reset use your backspace key)"]
[]
[null,null,"Prepare",null,"Sides"]
[null,null,{"$f":"INDEX($E$36:$E$63,RANK(F36,$F$36:$F$63))","v":"Roasted"},null,{"$f":"INDEX($H$36:$H$97,RANK(I36,$I$36:$I$97))","v":"Popcorn salted"}]
[null,null,{"$f":"INDEX($E$37:$E$63,RANK(F38,$F$37:$F$63))","v":"Nuggets"},null,{"$f":"INDEX($H$36:$H$97,RANK(I37,$I$36:$I$97))","v":"Biltong/Jerky"}]
[null,null,"Sliced",null,"Celery sticks"]
[null,null,"Quesadilla",null,"Popcorn caramel"]
[null,null,"Pulled/Shredded",null,"Vegetables"]
[null,null,"Battered",null,"Lemon bars",null,null,"Enter in your own ingredient choices"]
[null,null,"Skewer",null,"Dip"]
[null,null,"Stew",null,"Quesadilla"]
[null,null,"Soup",null,"Cheese"]
[null,null,"Samoosa",null,"Mini pies"]
[null,null,"Shwarma",null,"Devilled eggs"]
[null,null,"Pie",null,"Savoury biscuits"]
[null,null,"Mince",null,"Nuts and raisins"]
[]
[null,null,"protein",null,"prep",null,null,"side",null,"starch",null,"Ingredients"]
[null,null,"A none",0.71654735739651843,"A none",0.82860234530043131,null,"A none",0.72112890758252912,"A none",0.98284620619386687,"A none",0.42329451670228313]
[null,null,"Bacon",0.34464485452328231,"Balled",0.43472760369561025,null,"Biltong/Jerky",0.16447687850656789,"Bagels",0.71880662390646188,"Bacon",0.11182293167132595]
[null,null,"Beef",0.98438220360389117,"Battered",0.80762693964327648,null,"Boiled eggs",0.98496431667868922,"Baps",0.82871432027810366,"Bagels",0.97237872845401163]
[null,null,"Boerewors",0.82350599131617452,"Braised",0.52293769072965313,null,"Brownies",0.90776794187967513,"Barley",0.58265070769613225,"Bakery",0.14450127781183086]
[null,null,"Chicken",0.38047601831854017,"Cold",0.28715986812658911,null,"Cake",0.17184486788492415,"Bread ",0.92739482948021379,"Baps",0.33733664549288911]
[null,null,"Corned beef",0.44212176289511296,"Crumbed",0.46662522527472061,null,"Carrot sticks",1.0994958021447565E-2,"Breadsticks",0.8121139112419038,"Barley",0.18977716948334]
[null,null,"Deli meats",0.67588547189294035,"Filleted",0.46662785241332,null,"Celery sticks",0.39151477335174256,"Buns",0.78302663149464991,"Beef",0.28591306680398965]
[null,null,"Duck",0.46882146579151984,"Fried",0.96437918514709287,null,"Cereal bars",0.58762267392455936,"Cornchips",0.41662869719838502,"Biltong/Jerky",0.11947007121430209]
[null,null,"Fish",7.4900576804737162E-2,"Grilled",0.31221627831300969,null,"Cereals",0.14183147235603444,"Crackers",0.65758063238094666,"Boerewors",0.21413420981618314]
[null,null,"Lamb",0.79014143218874422,"Mince",9.7921715218769911E-2,null,"Cheese",0.80780719461272743,"Croissant",0.65722463238094697,"Boiled eggs",0.95570641108103127]
[null,null,"Macon",0.39192079802850088,"Nuggets",0.11963805527912708,null,"Cherry tomatoes",0.34970691942734788,"Matzos",0.17429828675163861,"Bread brown",0.78013566191137151]
[null,null,"Meatloaf",0.1914097474093599,"Pickled",0.36506546717369093,null,"Chips",0.58825839192158669,"Oats",0.31368960325624129,"Bread white",0.67233177892663853]
[null,null,"Oxtail",0.19223271717288437,"Pie",0.34918793738212239,null,"Chocolate",0.11435106870479506,"Pap",0.8970018960856998,"Breadsticks",0.97620122649876395]
[null,null,"Pork",0.72101481471201323,"Poached",0.48474704399286628,null,"Cookies",0.32416990029084647,"Pasta noodles",0.75858275616073279,"Brownies",0.82232463827204583]
[null,null,"Quail",0.81026126353609096,"Pulled/Shredded",0.7248769964861862,null,"Crisps",0.34519101248328254,"Pastry",0.37509203788478107,"Buns",0.3677999119156462]
[null,null,"Rabbit",0.1931006285261645,"Quesadilla",0.35397163374317153,null,"Crumpets",0.21668991201472909,"Pita",0.97046076894131084,"Butter",0.71147563629906563]
[null,null,"Sausage",0.28888008506412588,"Roasted",0.87027565988176636,null,"Cucumber sticks",0.30075392407274115,"Rice",0.39429857772554955,"Butter beans",0.19902826345640179]
[null,null,"Seafood",0.7716794007503941,"Roll",0.35446411152252444,null,"Devilled eggs",0.49227007027845782,"Rye",0.59918707410311134,"Cake",0.85874449089179394]
[null,null,"Steak",0.77169520416000004,"Samoosa",0.87237685890043404,null,"Dip",0.1242153640681487,"Samp",0.81409476918842372,"Carrot sticks",0.74074968863155066]
[null,null,"Turkey",0.65497889378558094,"Sandwich",0.44651531681480694,null,"Dried wors",0.40885477080136179,"Tacos",0.85579387511679939,"Celery sticks",0.38162081335010301]
[null,null,"Venison",0.49909188741554456,"Schnitzel",0.47961927540243043,null,"Egg mayonnaise",0.58835408696732827,"Tortilla",0.8520000784340459,"Cereal bars",0.88724395079533047]
[null,null,null,null,"Shwarma",0.96255165439273227,null,"Flapjacks",0.33528623139074565,null,null,"Cereals",0.72832525085698674]
[null,null,null,null,"Skewer",6.0069052353018071E-2,null,"Foccacia",0.9737653435357948,null,null,"Cheese sticks",0.37397421311835954]
[null,null,"Monday",null,"Sliced",6.512819917684165E-2,null,"Fruit",0.13203232468407511,null,null,"Cheeses",1.0823054194834092E-2]
[null,null,"Tuesday",null,"Soup",0.86748594419165059,null,"Fruit bars/strips",2.2876842334165981E-2,null,null,"Cherry tomatoes",0.10932934517205017]
[null,null,"Wednesday",null,"Stew",0.50918304813050319,null,"Fruit dried",0.16359635031516673,null,null,"Chicken",2.2251018393697475E-2]
[null,null,"Thursday",null,"Stuffed",3.1622430752114128E-2,null,"Granola",0.54011514900257485,null,null,"Chips",0.77877795742697664]
[null,null,"Friday",null,"Tremazzini",0.85852583536510207,null,"Greek Salad",0.52079793956624609,null,null,"Chocolate",0.7412516773186798]
[null,null,"Saturday",null,"Wrap",0.38490715749436921,null,"Lemon bars",0.12590009048468187,null,null,"Cookies",0.9689483885156972]
[null,null,null,null,null,null,null,"Mini pies",0.17892566982743718,null,null,"Cornchips",0.38195805759507262]
[null,null,null,null,null,null,null,"Meringue",0.23211724446180126,null,null,"Corned beef",0.87043857692062787]
[null,null,null,null,null,null,null,"Muffins",0.91392691779376378,null,null,"Crackers",0.34373339557133875]
[null,null,null,null,null,null,null,"Nuts",0.34730141748723153,null,null,"Crisps",6.3800429229526889E-3]
[null,null,null,null,null,null,null,"Nuts and raisins",3.0725389391724756E-2,null,null,"Crumbs",0.73845956733624019]
[null,null,null,null,null,null,null,"Olives",0.43594971038546648,null,null,"Crumpets",2.4628052950476875E-2]
[null,null,null,null,null,null,null,"Pancakes",0.68751633816116831,null,null,"Cucumber sticks",0.69927782699546714]
[null,null,null,null,null,null,null,"Pasta",0.62754417386706451,null,null,"Deli meats",0.7905607699576962]
[null,null,null,null,null,null,null,"Pasta salad",7.0805415558829909E-2,null,null,"Devilled eggs",0.34547601981506582]
[null,null,null,null,null,null,null,"Pastries",0.93023660099553762,null,null,"Dip",0.81899503225952885]
[null,null,null,null,null,null,null,"Pickles",0.434857820451378,null,null,"Dried wors",0.28397355092209386]
[null,null,null,null,null,null,null,"Pita",9.4277392220227796E-3,null,null,"Duck",0.70262033786237721]
[null,null,null,null,null,null,null,"Popcorn caramel",0.76656126259371049,null,null,"Egg mayonnaise",0.37526400031448626]
[null,null,null,null,null,null,null,"Popcorn salted",0.61171250107818309,null,null,"Eggs",0.44947442738050924]
[null,null,null,null,null,null,null,"Potatoes",0.81776466755444688,null,null,"Fish",0.81378014742522409]
[null,null,null,null,null,null,null,"Preserves",3.3641360686277766E-2,null,null,"Flapjacks",0.95116627838878154]
[null,null,null,null,null,null,null,"Pretzels",0.21697561388105213,null,null,"Foccacia",0.38488597280600367]
[null,null,null,null,null,null,null,"Pudding",0.50919485576042645,null,null,"Fruit",1.799499388393655E-2]
[null,null,null,null,null,null,null,"Quesadilla",0.15394432270679503,null,null,"Fruit bars/strips",0.62191284342875763]
[null,null,null,null,null,null,null,"Raisins",0.41355970857431457,null,null,"Fruit dried",0.41031234227809255]
[null,null,null,null,null,null,null,"Ricecakes",0.10352958701833059,null,null,"Fruit juice",0.57511923717258739]
[null,null,null,null,null,null,null,"Samoosas",1.9850006997756853E-2,null,null,"Ghee",1.7361692724525923E-2]
[null,null,null,null,null,null,null,"Sandwich",0.831417060063951,null,null,"Granola",0.59198190931994621]
[null,null,null,null,null,null,null,"Savoury biscuits",0.49518061251264422,null,null,"Greek Salad",0.74960350887483851]
[null,null,null,null,null,null,null,"Scones",0.14285220843359359,null,null,"Lamb",0.89910974283958678]
[null,null,null,null,null,null,null,"Soup",0.95008227605849238,null,null,"Lemon bars",0.12068955360331379]
[null,null,null,null,null,null,null,"Spring rolls",0.20819725766738473,null,null,"Macon",0.669832774801563]
[null,null,null,null,null,null,null,"Sushi",9.3728086953688949E-2,null,null,"Maize meal",0.82261210619153524]
[null,null,null,null,null,null,null,"Sweetcorn",0.1251105600443746,null,null,"Matzos",0.68165387797494548]
[null,null,null,null,null,null,null,"Tomatoes",0.2875925858406172,null,null,"Meat",0.15846918210458671]
[null,null,null,null,null,null,null,"Tuna",0.11378046253282426,null,null,"Meatloaf",0.44076028282505308]
[null,null,null,null,null,null,null,"Tuna mayonnaise",0.15194735718157437,null,null,"Meringue",0.21224311609887292]
[null,null,null,null,null,null,null,"Vegetables",0.63135449552686473,null,null,"Milk",0.6520097138782881]
[null,null,null,null,null,null,null,"Yoghurt",0.75727053491464791,null,null,"Mini pies",5.6268715481267217E-2]
[null,null,null,null,null,null,null,null,null,null,null,"Muffins",0.5017386329064536]
[null,null,null,null,null,null,null,null,null,null,null,"Nuts",3.0118392421493501E-2]
[null,null,null,null,null,null,null,null,null,null,null,"Nuts and raisins",0.70385523527085692]
[null,null,null,null,null,null,null,null,null,null,null,"Oats",0.33571482428363941]
[null,null,null,null,null,null,null,null,null,null,null,"Oil",0.70040374953692563]
[null,null,null,null,null,null,null,null,null,null,null,"Olives",0.89748384516647961]
[null,null,null,null,null,null,null,null,null,null,null,"Oxtail",7.5323921287894779E-2]
[null,null,null,null,null,null,null,null,null,null,null,"Pancakes",0.78139431375226076]
[null,null,null,null,null,null,null,null,null,null,null,"Pap",0.82511015780700403]
[null,null,null,null,null,null,null,null,null,null,null,"Pasta",6.9687909077582377E-2]
[null,null,null,null,null,null,null,null,null,null,null,"Pasta noodles",0.35616557295322671]
[null,null,null,null,null,null,null,null,null,null,null,"Pasta salad",0.37002222246235061]
[null,null,null,null,null,null,null,null,null,null,null,"Pastries",0.5389086108883574]
[null,null,null,null,null,null,null,null,null,null,null,"Pastry",0.97757640478927488]
[null,null,null,null,null,null,null,null,null,null,null,"Pepper",0.82381261280438678]
[null,null,null,null,null,null,null,null,null,null,null,"Pickled gherkins",0.55287198312361052]
[null,null,null,null,null,null,null,null,null,null,null,"Pickled onions",0.55345263755508944]
[null,null,null,null,null,null,null,null,null,null,null,"Pita mini pouches",0.58207737716139207]
[null,null,null,null,null,null,null,null,null,null,null,"Pita pouches",0.89904330449817849]
[null,null,null,null,null,null,null,null,null,null,null,"Popcorn",0.42740600160747588]
[null,null,null,null,null,null,null,null,null,null,null,"Popcorn caramel",0.32212332014612932]
[null,null,null,null,null,null,null,null,null,null,null,"Popcorn salted",0.24107935065712061]
[null,null,null,null,null,null,null,null,null,null,null,"Pork",0.75379305165278709]
[null,null,null,null,null,null,null,null,null,null,null,"Potatoes",0.94300077010664451]
[null,null,null,null,null,null,null,null,null,null,null,"Prawna",5.2570553697359079E-2]
[null,null,null,null,null,null,null,null,null,null,null,"Preserves",0.48502566652889811]
[null,null,null,null,null,null,null,null,null,null,null,"Pretzel sticks",0.40774992543428101]
[null,null,null,null,null,null,null,null,null,null,null,"Pretzels",0.98975890333674188]
[null,null,null,null,null,null,null,null,null,null,null,"Pudding",0.18249536757266915]
[null,null,null,null,null,null,null,null,null,null,null,"Quail",7.3517573897876387E-2]
[null,null,null,null,null,null,null,null,null,null,null,"Quesadilla",7.1939806348284785E-2]
[null,null,null,null,null,null,null,null,null,null,null,"Rabbit",6.7971689259026635E-2]
[null,null,null,null,null,null,null,null,null,null,null,"Raisins",0.2741894698901568]
[null,null,null,null,null,null,null,null,null,null,null,"Rice",0.30896527044903821]
[null,null,null,null,null,null,null,null,null,null,null,"Rice",0.57197164139501]
[null,null,null,null,null,null,null,null,null,null,null,"Ricecakes",0.86707746233050309]
[null,null,null,null,null,null,null,null,null,null,null,"Rock Buns",0.79629325701099396]
[null,null,null,null,null,null,null,null,null,null,null,"Rye",0.65151803212836845]
[null,null,null,null,null,null,null,null,null,null,null,"Salt",0.44885920123426926]
[null,null,null,null,null,null,null,null,null,null,null,"Samoosas",0.14173503835236578]
[null,null,null,null,null,null,null,null,null,null,null,"Samp",0.70818771575725115]
[null,null,null,null,null,null,null,null,null,null,null,"Sandwich",0.1423085436588486]
[null,null,null,null,null,null,null,null,null,null,null,"Sauce/Spreads",0.1214863398049717]
[null,null,null,null,null,null,null,null,null,null,null,"Sausage",0.81076462846745123]
[null,null,null,null,null,null,null,null,null,null,null,"Savoury biscuits",0.56592363161955805]
[null,null,null,null,null,null,null,null,null,null,null,"Scones",0.86886798403410337]
[null,null,null,null,null,null,null,null,null,null,null,"Seafood",0.3182999648775251]
[null,null,null,null,null,null,null,null,null,null,null,"Snacks",0.39954792511926784]
[null,null,null,null,null,null,null,null,null,null,null,"Soup",0.68434992449862619]
[null,null,null,null,null,null,null,null,null,null,null,"Spring rolls",0.16016188257834907]
[null,null,null,null,null,null,null,null,null,null,null,"Starch",0.29955279127723011]
[null,null,null,null,null,null,null,null,null,null,null,"Sugar",8.2905283489647097E-2]
[null,null,null,null,null,null,null,null,null,null,null,"Sushi",0.10265738662629664]
[null,null,null,null,null,null,null,null,null,null,null,"Sweetcorn",0.7204379128891325]
[null,null,null,null,null,null,null,null,null,null,null,"Tacos",0.570484407078508]
[null,null,null,null,null,null,null,null,null,null,null,"Tomatoes",2.5694195017970101E-2]
[null,null,null,null,null,null,null,null,null,null,null,"Tortilla",0.74423685809751161]
[null,null,null,null,null,null,null,null,null,null,null,"Tuna",0.32532401916550879]
[null,null,null,null,null,null,null,null,null,null,null,"Tuna mayonnaise",6.551928931955997E-2]
[null,null,null,null,null,null,null,null,null,null,null,"Turkey",0.24486910985372268]
[null,null,null,null,null,null,null,null,null,null,null,"Vegetable soup",0.90328819068377808]
[null,null,null,null,null,null,null,null,null,null,null,"Vegetables",0.58125701000226671]
[null,null,null,null,null,null,null,null,null,null,null,"Venison",0.39492688595686698]
[null,null,null,null,null,null,null,null,null,null,null,"Yoghurt",0.81541346282975324]

{"sheet":"Preview","index":2,"n_rows":161,"n_cols":13,"rows_kept":161,"cut":false,"hidden":false,"merged":[[2,2,2,4],[4,2,4,4]]}
[]
[]
[null,null,"Items",null,null,null,null,null,"Today's lunchbox",null,null,null,"Monday"]
[]
[null,null,"Random suggestions",null,null,null,null,"Protein 1","Protein 2","Protein 3",null,"Select  day & click create lunchbox"]
[null,null,null,null,null,null,null,{"$f":"'Step 1'!$H$6","v":"A none"},{"$f":"'Step 1'!$I$6","v":"A none"},{"$f":"'Step 1'!$J$6","v":"A none"}]
[null,null,"Protein",null,"Starch"]
[null,null,{"$f":"INDEX($C$36:$C$55,RANK(D36,$D$36:$D$55))","v":"Rabbit"},null,{"$f":"INDEX($J$36:$J$55,RANK(K36,$K$36:$K$55))","v":"Oats"},null,null,"Prep1","Prep 2","Prep 3"]
[null,null,{"$f":"INDEX($C$36:$C$55,RANK(D37,$D$36:$D$55))","v":"Bacon"},null,"Buns",null,null,{"$f":"'Step 1'!$H$9","v":"A none"},{"$f":"'Step 1'!$I$9","v":"A none"},{"$f":"'Step 1'!$J$9","v":"A none"}]
[null,null,"Beef",null,"Pita"]
[null,null,"Quail",null,"Baps",null,null,"Starch 1","Starch 2","Starch 3","Starch 4"]
[null,null,"Oxtail",null,"Crackers",null,null,{"$f":"'Step 1'!$H$12","v":"A none"},{"$f":"'Step 1'!$I$12","v":"A none"},{"$f":"'Step 1'!$J$12","v":"A none"},{"$f":"'Step 1'!$K$12","v":"A none"}]
[null,null,"Fish",null,"Croissant"]
[null,null,"Meatloaf",null,"Rice",null,null,"Side 1","Side 2","Side 3","Side 4","Side 5","Side 6"]
[null,null,"Venison",null,"Pap",null,null,{"$f":"'Step 1'!$H$15","v":"A none"},{"$f":"'Step 1'!$I$15","v":"A none"},{"$f":"'Step 1'!$J$15","v":"A none"},{"$f":"'Step 1'!$K$15","v":"A none"},{"$f":"'Step 1'!$L$15","v":"A none"},{"$f":"'Step 1'!$M$15","v":"A none"}]
[null,null,"Chicken",null,{"$f":"INDEX($J$36:$J$55,RANK(K45,$K$36:$K$55))","v":"Tortilla"},null,null,"Please check your selections ABOVE as they are not changeable once the day sheet has been created"]
[null,null,"Pork",null,{"$f":"INDEX($J$36:$J$55,RANK(K46,$K$36:$K$55))","v":"Tacos"},null,null,"Enter the ingredients you need (create your shopping list - you can edit these once your sheet has been created)"]
[null,null,null,null,null,null,null,{"$f":"'Step 1'!H18","v":0},{"$f":"'Step 1'!I18","v":0},{"$f":"'Step 1'!J18","v":0},{"$f":"'Step 1'!K18","v":0},{"$f":"'Step 1'!L18","v":0},{"$f":"'Step 1'!M18","v":0}]
[null,null,"Prepare",null,"Sides",null,null,{"$f":"'Step 1'!H19","v":0},{"$f":"'Step 1'!I19","v":0},{"$f":"'Step 1'!J19","v":0},{"$f":"'Step 1'!K19","v":0},{"$f":"'Step 1'!L19","v":0},{"$f":"'Step 1'!M19","v":0}]
[null,null,{"$f":"INDEX($E$36:$E$63,RANK(F36,$F$36:$F$63))","v":"Roasted"},null,{"$f":"INDEX($H$36:$H$97,RANK(I36,$I$36:$I$97))","v":"Popcorn salted"},null,null,{"$f":"'Step 1'!H20","v":0},{"$f":"'Step 1'!I20","v":0},{"$f":"'Step 1'!J20","v":0},{"$f":"'Step 1'!K20","v":0},{"$f":"'Step 1'!L20","v":0},{"$f":"'Step 1'!M20","v":0}]
[null,null,{"$f":"INDEX($E$37:$E$63,RANK(F38,$F$37:$F$63))","v":"Nuggets"},null,{"$f":"INDEX($H$36:$H$97,RANK(I37,$I$36:$I$97))","v":"Biltong/Jerky"},null,null,{"$f":"'Step 1'!H21","v":0},{"$f":"'Step 1'!I21","v":0},{"$f":"'Step 1'!J21","v":0},{"$f":"'Step 1'!K21","v":0},{"$f":"'Step 1'!L21","v":0},{"$f":"'Step 1'!M21","v":0}]
[null,null,"Sliced",null,"Celery sticks",null,null,{"$f":"'Step 1'!H22","v":0},{"$f":"'Step 1'!I22","v":0},{"$f":"'Step 1'!J22","v":0},{"$f":"'Step 1'!K22","v":0},{"$f":"'Step 1'!L22","v":0},{"$f":"'Step 1'!M22","v":0}]
[null,null,"Quesadilla",null,"Popcorn caramel",null,null,{"$f":"'Step 1'!H23","v":0},{"$f":"'Step 1'!I23","v":0},{"$f":"'Step 1'!J23","v":0},{"$f":"'Step 1'!K23","v":0},{"$f":"'Step 1'!L23","v":0},{"$f":"'Step 1'!M23","v":0}]
[null,null,"Pulled/Shredded",null,"Vegetables",null,null,{"$f":"'Step 1'!H24","v":0},{"$f":"'Step 1'!I24","v":0},{"$f":"'Step 1'!J24","v":0},{"$f":"'Step 1'!K24","v":0},{"$f":"'Step 1'!L24","v":0},{"$f":"'Step 1'!M24","v":0}]
[null,null,"Battered",null,"Lemon bars",null,null,"Enter in your own ingredient choices"]
[null,null,"Skewer",null,"Dip"]
[null,null,"Stew",null,"Quesadilla"]
[null,null,"Soup",null,"Cheese"]
[null,null,"Samoosa",null,"Mini pies"]
[null,null,"Shwarma",null,"Devilled eggs"]
[null,null,"Pie",null,"Savoury biscuits"]
[null,null,"Mince",null,"Nuts and raisins"]
[]
[null,null,"protein",null,"prep",null,null,"side",null,"starch",null,"Ingredients"]
[null,null,"A none",0.71654735739651843,"A none",0.82860234530043131,null,"A none",0.72112890758252912,"A none",0.98284620619386687,"A none",0.42329451670228313]
[null,null,"Bacon",0.34464485452328231,"Balled",0.43472760369561025,null,"Biltong/Jerky",0.16447687850656789,"Bagels",0.71880662390646188,"Bacon",0.11182293167132595]
[null,null,"Beef",0.98438220360389117,"Battered",0.80762693964327648,null,"Boiled eggs",0.98496431667868922,"Baps",0.82871432027810366,"Bagels",0.97237872845401163]
[null,null,"Boerewors",0.82350599131617452,"Braised",0.52293769072965313,null,"Brownies",0.90776794187967513,"Barley",0.58265070769613225,"Bakery",0.14450127781183086]
[null,null,"Chicken",0.38047601831854017,"Cold",0.28715986812658911,null,"Cake",0.17184486788492415,"Bread ",0.92739482948021379,"Baps",0.33733664549288911]
[null,null,"Corned beef",0.44212176289511296,"Crumbed",0.46662522527472061,null,"Carrot sticks",1.0994958021447565E-2,"Breadsticks",0.8121139112419038,"Barley",0.18977716948334]
[null,null,"Deli meats",0.67588547189294035,"Filleted",0.46662785241332,null,"Celery sticks",0.39151477335174256,"Buns",0.78302663149464991,"Beef",0.28591306680398965]
[null,null,"Duck",0.46882146579151984,"Fried",0.96437918514709287,null,"Cereal bars",0.58762267392455936,"Cornchips",0.41662869719838502,"Biltong/Jerky",0.11947007121430209]
[null,null,"Fish",7.4900576804737162E-2,"Grilled",0.31221627831300969,null,"Cereals",0.14183147235603444,"Crackers",0.65758063238094666,"Boerewors",0.21413420981618314]
[null,null,"Lamb",0.79014143218874422,"Mince",9.7921715218769911E-2,null,"Cheese",0.80780719461272743,"Croissant",0.65722463238094697,"Boiled eggs",0.95570641108103127]
[null,null,"Macon",0.39192079802850088,"Nuggets",0.11963805527912708,null,"Cherry tomatoes",0.34970691942734788,"Matzos",0.17429828675163861,"Bread brown",0.78013566191137151]
[null,null,"Meatloaf",0.1914097474093599,"Pickled",0.36506546717369093,null,"Chips",0.58825839192158669,"Oats",0.31368960325624129,"Bread white",0.67233177892663853]
[null,null,"Oxtail",0.19223271717288437,"Pie",0.34918793738212239,null,"Chocolate",0.11435106870479506,"Pap",0.8970018960856998,"Breadsticks",0.97620122649876395]
[null,null,"Pork",0.72101481471201323,"Poached",0.48474704399286628,null,"Cookies",0.32416990029084647,"Pasta noodles",0.75858275616073279,"Brownies",0.82232463827204583]
[null,null,"Quail",0.81026126353609096,"Pulled/Shredded",0.7248769964861862,null,"Crisps",0.34519101248328254,"Pastry",0.37509203788478107,"Buns",0.3677999119156462]
[null,null,"Rabbit",0.1931006285261645,"Quesadilla",0.35397163374317153,null,"Crumpets",0.21668991201472909,"Pita",0.97046076894131084,"Butter",0.71147563629906563]
[null,null,"Sausage",0.28888008506412588,"Roasted",0.87027565988176636,null,"Cucumber sticks",0.30075392407274115,"Rice",0.39429857772554955,"Butter beans",0.19902826345640179]
[null,null,"Seafood",0.7716794007503941,"Roll",0.35446411152252444,null,"Devilled eggs",0.49227007027845782,"Rye",0.59918707410311134,"Cake",0.85874449089179394]
[null,null,"Steak",0.77169520416000004,"Samoosa",0.87237685890043404,null,"Dip",0.1242153640681487,"Samp",0.81409476918842372,"Carrot sticks",0.74074968863155066]
[null,null,"Turkey",0.65497889378558094,"Sandwich",0.44651531681480694,null,"Dried wors",0.40885477080136179,"Tacos",0.85579387511679939,"Celery sticks",0.38162081335010301]
[null,null,"Venison",0.49909188741554456,"Schnitzel",0.47961927540243043,null,"Egg mayonnaise",0.58835408696732827,"Tortilla",0.8520000784340459,"Cereal bars",0.88724395079533047]
[null,null,null,null,"Shwarma",0.96255165439273227,null,"Flapjacks",0.33528623139074565,null,null,"Cereals",0.72832525085698674]
[null,null,null,null,"Skewer",6.0069052353018071E-2,null,"Foccacia",0.9737653435357948,null,null,"Cheese sticks",0.37397421311835954]
[null,null,"Monday",null,"Sliced",6.512819917684165E-2,null,"Fruit",0.13203232468407511,null,null,"Cheeses",1.0823054194834092E-2]
[null,null,"Tuesday",null,"Soup",0.86748594419165059,null,"Fruit bars/strips",2.2876842334165981E-2,null,null,"Cherry tomatoes",0.10932934517205017]
[null,null,"Wednesday",null,"Stew",0.50918304813050319,null,"Fruit dried",0.16359635031516673,null,null,"Chicken",2.2251018393697475E-2]
[null,null,"Thursday",null,"Stuffed",3.1622430752114128E-2,null,"Granola",0.54011514900257485,null,null,"Chips",0.77877795742697664]
[null,null,"Friday",null,"Tremazzini",0.85852583536510207,null,"Greek Salad",0.52079793956624609,null,null,"Chocolate",0.7412516773186798]
[null,null,"Saturday",null,"Wrap",0.38490715749436921,null,"Lemon bars",0.12590009048468187,null,null,"Cookies",0.9689483885156972]
[null,null,null,null,null,null,null,"Mini pies",0.17892566982743718,null,null,"Cornchips",0.38195805759507262]
[null,null,null,null,null,null,null,"Meringue",0.23211724446180126,null,null,"Corned beef",0.87043857692062787]
[null,null,null,null,null,null,null,"Muffins",0.91392691779376378,null,null,"Crackers",0.34373339557133875]
[null,null,null,null,null,null,null,"Nuts",0.34730141748723153,null,null,"Crisps",6.3800429229526889E-3]
[null,null,null,null,null,null,null,"Nuts and raisins",3.0725389391724756E-2,null,null,"Crumbs",0.73845956733624019]
[null,null,null,null,null,null,null,"Olives",0.43594971038546648,null,null,"Crumpets",2.4628052950476875E-2]
[null,null,null,null,null,null,null,"Pancakes",0.68751633816116831,null,null,"Cucumber sticks",0.69927782699546714]
[null,null,null,null,null,null,null,"Pasta",0.62754417386706451,null,null,"Deli meats",0.7905607699576962]
[null,null,null,null,null,null,null,"Pasta salad",7.0805415558829909E-2,null,null,"Devilled eggs",0.34547601981506582]
[null,null,null,null,null,null,null,"Pastries",0.93023660099553762,null,null,"Dip",0.81899503225952885]
[null,null,null,null,null,null,null,"Pickles",0.434857820451378,null,null,"Dried wors",0.28397355092209386]
[null,null,null,null,null,null,null,"Pita",9.4277392220227796E-3,null,null,"Duck",0.70262033786237721]
[null,null,null,null,null,null,null,"Popcorn caramel",0.76656126259371049,null,null,"Egg mayonnaise",0.37526400031448626]
[null,null,null,null,null,null,null,"Popcorn salted",0.61171250107818309,null,null,"Eggs",0.44947442738050924]
[null,null,null,null,null,null,null,"Potatoes",0.81776466755444688,null,null,"Fish",0.81378014742522409]
[null,null,null,null,null,null,null,"Preserves",3.3641360686277766E-2,null,null,"Flapjacks",0.95116627838878154]
[null,null,null,null,null,null,null,"Pretzels",0.21697561388105213,null,null,"Foccacia",0.38488597280600367]
[null,null,null,null,null,null,null,"Pudding",0.50919485576042645,null,null,"Fruit",1.799499388393655E-2]
[null,null,null,null,null,null,null,"Quesadilla",0.15394432270679503,null,null,"Fruit bars/strips",0.62191284342875763]
[null,null,null,null,null,null,null,"Raisins",0.41355970857431457,null,null,"Fruit dried",0.41031234227809255]
[null,null,null,null,null,null,null,"Ricecakes",0.10352958701833059,null,null,"Fruit juice",0.57511923717258739]
[null,null,null,null,null,null,null,"Samoosas",1.9850006997756853E-2,null,null,"Ghee",1.7361692724525923E-2]
[null,null,null,null,null,null,null,"Sandwich",0.831417060063951,null,null,"Granola",0.59198190931994621]
[null,null,null,null,null,null,null,"Savoury biscuits",0.49518061251264422,null,null,"Greek Salad",0.74960350887483851]
[null,null,null,null,null,null,null,"Scones",0.14285220843359359,null,null,"Lamb",0.89910974283958678]
[null,null,null,null,null,null,null,"Soup",0.95008227605849238,null,null,"Lemon bars",0.12068955360331379]
[null,null,null,null,null,null,null,"Spring rolls",0.20819725766738473,null,null,"Macon",0.669832774801563]
[null,null,null,null,null,null,null,"Sushi",9.3728086953688949E-2,null,null,"Maize meal",0.82261210619153524]
[null,null,null,null,null,null,null,"Sweetcorn",0.1251105600443746,null,null,"Matzos",0.68165387797494548]
[null,null,null,null,null,null,null,"Tomatoes",0.2875925858406172,null,null,"Meat",0.15846918210458671]
[null,null,null,null,null,null,null,"Tuna",0.11378046253282426,null,null,"Meatloaf",0.44076028282505308]
[null,null,null,null,null,null,null,"Tuna mayonnaise",0.15194735718157437,null,null,"Meringue",0.21224311609887292]
[null,null,null,null,null,null,null,"Vegetables",0.63135449552686473,null,null,"Milk",0.6520097138782881]
[null,null,null,null,null,null,null,"Yoghurt",0.75727053491464791,null,null,"Mini pies",5.6268715481267217E-2]
[null,null,null,null,null,null,null,null,null,null,null,"Muffins",0.5017386329064536]
[null,null,null,null,null,null,null,null,null,null,null,"Nuts",3.0118392421493501E-2]
[null,null,null,null,null,null,null,null,null,null,null,"Nuts and raisins",0.70385523527085692]
[null,null,null,null,null,null,null,null,null,null,null,"Oats",0.33571482428363941]
[null,null,null,null,null,null,null,null,null,null,null,"Oil",0.70040374953692563]
[null,null,null,null,null,null,null,null,null,null,null,"Olives",0.89748384516647961]
[null,null,null,null,null,null,null,null,null,null,null,"Oxtail",7.5323921287894779E-2]
[null,null,null,null,null,null,null,null,null,null,null,"Pancakes",0.78139431375226076]
[null,null,null,null,null,null,null,null,null,null,null,"Pap",0.82511015780700403]
[null,null,null,null,null,null,null,null,null,null,null,"Pasta",6.9687909077582377E-2]
[null,null,null,null,null,null,null,null,null,null,null,"Pasta noodles",0.35616557295322671]
[null,null,null,null,null,null,null,null,null,null,null,"Pasta salad",0.37002222246235061]
[null,null,null,null,null,null,null,null,null,null,null,"Pastries",0.5389086108883574]
[null,null,null,null,null,null,null,null,null,null,null,"Pastry",0.97757640478927488]
[null,null,null,null,null,null,null,null,null,null,null,"Pepper",0.82381261280438678]
[null,null,null,null,null,null,null,null,null,null,null,"Pickled gherkins",0.55287198312361052]
[null,null,null,null,null,null,null,null,null,null,null,"Pickled onions",0.55345263755508944]
[null,null,null,null,null,null,null,null,null,null,null,"Pita mini pouches",0.58207737716139207]
[null,null,null,null,null,null,null,null,null,null,null,"Pita pouches",0.89904330449817849]
[null,null,null,null,null,null,null,null,null,null,null,"Popcorn",0.42740600160747588]
[null,null,null,null,null,null,null,null,null,null,null,"Popcorn caramel",0.32212332014612932]
[null,null,null,null,null,null,null,null,null,null,null,"Popcorn salted",0.24107935065712061]
[null,null,null,null,null,null,null,null,null,null,null,"Pork",0.75379305165278709]
[null,null,null,null,null,null,null,null,null,null,null,"Potatoes",0.94300077010664451]
[null,null,null,null,null,null,null,null,null,null,null,"Prawna",5.2570553697359079E-2]
[null,null,null,null,null,null,null,null,null,null,null,"Preserves",0.48502566652889811]
[null,null,null,null,null,null,null,null,null,null,null,"Pretzel sticks",0.40774992543428101]
[null,null,null,null,null,null,null,null,null,null,null,"Pretzels",0.98975890333674188]
[null,null,null,null,null,null,null,null,null,null,null,"Pudding",0.18249536757266915]
[null,null,null,null,null,null,null,null,null,null,null,"Quail",7.3517573897876387E-2]
[null,null,null,null,null,null,null,null,null,null,null,"Quesadilla",7.1939806348284785E-2]
[null,null,null,null,null,null,null,null,null,null,null,"Rabbit",6.7971689259026635E-2]
[null,null,null,null,null,null,null,null,null,null,null,"Raisins",0.2741894698901568]
[null,null,null,null,null,null,null,null,null,null,null,"Rice",0.30896527044903821]
[null,null,null,null,null,null,null,null,null,null,null,"Rice",0.57197164139501]
[null,null,null,null,null,null,null,null,null,null,null,"Ricecakes",0.86707746233050309]
[null,null,null,null,null,null,null,null,null,null,null,"Rock Buns",0.79629325701099396]
[null,null,null,null,null,null,null,null,null,null,null,"Rye",0.65151803212836845]
[null,null,null,null,null,null,null,null,null,null,null,"Salt",0.44885920123426926]
[null,null,null,null,null,null,null,null,null,null,null,"Samoosas",0.14173503835236578]
[null,null,null,null,null,null,null,null,null,null,null,"Samp",0.70818771575725115]
[null,null,null,null,null,null,null,null,null,null,null,"Sandwich",0.1423085436588486]
[null,null,null,null,null,null,null,null,null,null,null,"Sauce/Spreads",0.1214863398049717]
[null,null,null,null,null,null,null,null,null,null,null,"Sausage",0.81076462846745123]
[null,null,null,null,null,null,null,null,null,null,null,"Savoury biscuits",0.56592363161955805]
[null,null,null,null,null,null,null,null,null,null,null,"Scones",0.86886798403410337]
[null,null,null,null,null,null,null,null,null,null,null,"Seafood",0.3182999648775251]
[null,null,null,null,null,null,null,null,null,null,null,"Snacks",0.39954792511926784]
[null,null,null,null,null,null,null,null,null,null,null,"Soup",0.68434992449862619]
[null,null,null,null,null,null,null,null,null,null,null,"Spring rolls",0.16016188257834907]
[null,null,null,null,null,null,null,null,null,null,null,"Starch",0.29955279127723011]
[null,null,null,null,null,null,null,null,null,null,null,"Sugar",8.2905283489647097E-2]
[null,null,null,null,null,null,null,null,null,null,null,"Sushi",0.10265738662629664]
[null,null,null,null,null,null,null,null,null,null,null,"Sweetcorn",0.7204379128891325]
[null,null,null,null,null,null,null,null,null,null,null,"Tacos",0.570484407078508]
[null,null,null,null,null,null,null,null,null,null,null,"Tomatoes",2.5694195017970101E-2]
[null,null,null,null,null,null,null,null,null,null,null,"Tortilla",0.74423685809751161]
[null,null,null,null,null,null,null,null,null,null,null,"Tuna",0.32532401916550879]
[null,null,null,null,null,null,null,null,null,null,null,"Tuna mayonnaise",6.551928931955997E-2]
[null,null,null,null,null,null,null,null,null,null,null,"Turkey",0.24486910985372268]
[null,null,null,null,null,null,null,null,null,null,null,"Vegetable soup",0.90328819068377808]
[null,null,null,null,null,null,null,null,null,null,null,"Vegetables",0.58125701000226671]
[null,null,null,null,null,null,null,null,null,null,null,"Venison",0.39492688595686698]
[null,null,null,null,null,null,null,null,null,null,null,"Yoghurt",0.81541346282975324]

{"sheet":"day","index":3,"n_rows":1,"n_cols":2,"rows_kept":1,"cut":false,"hidden":true,"merged":[]}
[null,{"$f":"Preview!M3","v":"Monday"}]